Welcome to the Dash Forum!

Please sign up to discuss the most innovative cryptocurrency!

Errors while trying to compile dash

Discussion in 'Development Tech Discussion' started by demo, Jul 27, 2017.

  1. demo

    demo Well-known Member

    Joined:
    Apr 23, 2016
    Messages:
    3,114
    Likes Received:
    263
    Trophy Points:
    153
    Dash Address:
    XnpT2YQaYpyh7F9twM6EtDMn1TCDCEEgNX
    I tried to compile dash, and the make command stopped here:
    Code:
    At global scope:
    cc1plus: warning: unrecognized command line option ‘-Wno-self-assign’
    Makefile:6850: recipe for target 'qt/qt_libbitcoinqt_a-masternodelist.o' failed
    make[2]: *** [qt/qt_libbitcoinqt_a-masternodelist.o] Error 1
    make[2]: Leaving directory '/home/d/src/dash/src'
    Makefile:9045: recipe for target 'all-recursive' failed
    make[1]: *** [all-recursive] Error 1
    make[1]: Leaving directory '/home/d/src/dash/src'
    Makefile:652: recipe for target 'all-recursive' failed
    make: *** [all-recursive] Error 1
    any ideas whats going wrong ?
     
  2. demo

    demo Well-known Member

    Joined:
    Apr 23, 2016
    Messages:
    3,114
    Likes Received:
    263
    Trophy Points:
    153
    Dash Address:
    XnpT2YQaYpyh7F9twM6EtDMn1TCDCEEgNX
  3. demo

    demo Well-known Member

    Joined:
    Apr 23, 2016
    Messages:
    3,114
    Likes Received:
    263
    Trophy Points:
    153
    Dash Address:
    XnpT2YQaYpyh7F9twM6EtDMn1TCDCEEgNX
    Let me report here that I manage to compile Bitcoin in my system.
    But Dash cannot compile.
    I will try also to compile PIVX, and if I fail again then I will start implementing @Pietro Speroni 's request based on bitcoin's codebase.
     
    #3 demo, Jul 29, 2017
    Last edited: Jul 29, 2017